Target
Cholinesterase
Ligand
BDBM8961
Substrate
Meas. Tech.
ChEMBL_1663552 (CHEMBL4013233)
IC50
3.2±n/a nM
Citation
 Peauger, LAzzouz, RGembus, VTîntas, MLSopková-de Oliveira Santos, JBohn, PPapamicaël, CLevacher, V Donepezil-Based Central Acetylcholinesterase Inhibitors by Means of a"Bio-Oxidizable" Prodrug Strategy: Design, Synthesis, and in Vitro Biological Evaluation. J Med Chem 60:5909-5926 (2017)  
Target
Name:
Cholinesterase
Synonyms:
BCHE CHLE_HORSE | Cholinesterase
Type:
Enzyme
Mol. Mass.:
65643.35
Organism:
Equus caballus (Horse)
Description:
P81908
Residue:
574
  
Inhibitor
Name:
BDBM8961
Synonyms:
1,2,3,4-tetrahydro-9-acridinamine 9-THA CHEMBL1337960 Cognex Tracine cid_1935 | tacrine.HCl
Type:
Small organic molecule
Emp. Form.:
C13H14N2
Mol. Mass.:
198.2637
SMILES:
Nc1c2CCCCc2nc2ccccc12
: