Target
Carbonic anhydrase 1
Ligand
BDBM50015184
Substrate
Meas. Tech.
ChEMBL_1664113 (CHEMBL4013794)
Ki
83100±n/a nM
Citation
 Falsini, MSquarcialupi, LCatarzi, DVarano, FBetti, MDi Cesare Mannelli, LTenci, BGhelardini, CTanc, MAngeli, ASupuran, CTColotta, V 3-Hydroxy-1H-quinazoline-2,4-dione as a New Scaffold To Develop Potent and Selective Inhibitors of the Tumor-Associated Carbonic Anhydrases IX and XII. J Med Chem 60:6428-6439 (2017)  
Target
Name:
Carbonic anhydrase 1
Synonyms:
CA-I CAB Carbonate dehydratase I Carbonic anhydrase 1 (CA I) Carbonic anhydrase 1 (Recombinant CA I) Carbonic anhydrase B Carbonic anhydrase I (CA I) Carbonic anhydrase I (CAI) Carbonic anhydrase isoenzyme I (hCA I) | hCA
Type:
Enzyme
Mol. Mass.:
28873.37
Organism:
Homo sapiens (Human)
Description:
P00915
Residue:
261
  
Inhibitor
Name:
BDBM50015184
Synonyms:
BENZHYDROXAMIC ACID CHEMBL16300 N-hydroxybenzamide | benzoyl hydroxamic acid
Type:
Small organic molecule
Emp. Form.:
C7H7NO2
Mol. Mass.:
137.136
SMILES:
ONC(=O)c1ccccc1
: