Target
5-hydroxytryptamine receptor 2C
Ligand
BDBM82516
Substrate
Ki
42.1±n/a nM
Comments
PDSP_282
Citation
 Nelson, DLLucaites, VLAudia, JENissen, JSWainscott, DB Species differences in the pharmacology of the 5-hydroxytryptamine2 receptor: structurally specific differentiation by ergolines and tryptamines. J Pharmacol Exp Ther 265:1272-9 (1993) Target
Name:
5-hydroxytryptamine receptor 2C
Synonyms:
5-HT-2C 5-HT2C-INI 5-HTR2C 5-hydroxytryptamine receptor 2C (5-HT-2C) 5HT-1C HTR1C Serotonin (5-HT3) receptor Serotonin Receptor 2C
Type:
G Protein-Coupled Receptor (GPCR)
Mol. Mass.:
51836.79
Organism:
Homo sapiens (Human)
Description:
P28335
Residue:
458
  
Inhibitor
Name:
BDBM82516
Synonyms:
AMESERGIDE NSC_60740
Type:
Small organic molecule
Emp. Form.:
C25H35N3O
Mol. Mass.:
393.5649
SMILES:
CC(C)n1cc2CC3C(CC(CN3C)C(=O)NC3CCCCC3)c3cccc1c23
: