Target
Protein kinase C gamma type
Ligand
BDBM3187
Substrate
Lysine-rich histone
Meas. Tech.
PKC assay
IC50
2600±n/a nM
Citation
 Defauw, JMMurphy, MMJagdmann, GEHu, HLampe, JWHollinshead, SPMitchell, TJCrane, HMHeerding, JMMendoza, JSDavis, JEDarges, JWHubbard, FRHall, SE Synthesis and protein kinase C inhibitory activities of acyclic balanol analogs that are highly selective for protein kinase C over protein kinase A. J Med Chem 39:5215-27 (1996)  
Target
Name:
Protein kinase C gamma type
Synonyms:
KPCG_HUMAN PKC-gamma PRKCG Protein kinase C gamma type Protein kinase C, gamma
Type:
Enzyme
Mol. Mass.:
78458.05
Organism:
Homo sapiens (Human)
Description:
The recombinant human PKC enzymes were produced using a baculovirus expression system in SF9 cells
Residue:
697
  
Inhibitor
Name:
BDBM3187
Synonyms:
(R)-2-[[2,6-Dihydroxy-4-[[[3-(4-hydroxyphenyl)-2-[(phenylsulfonyl)amino]propyl]oxy]carbonyl]phenyl]carbonyl]-3-hydroxybenzoic Acid Acyclic Balanol Analog 12b(R)
Type:
Small organic molecule
Emp. Form.:
C30H25NO11S
Mol. Mass.:
607.585
SMILES:
OC(=O)c1cccc(O)c1C(=O)c1c(O)cc(cc1O)C(=O)OC[C@@H](Cc1ccc(O)cc1)NS(=O)(=O)c1ccccc1
:
Substrate
Name:
Lysine-rich histone
Synonyms:
ING Peptide histone type IIIS
Type:
Peptide
Mol. Mass.:
10508.21
Organism:
Bos taurus (bovine)
Description:
Purified as a lysine rich fraction of histone H1 from calf thymus.
Residue:
105