Target
cAMP-dependent protein kinase catalytic subunit alpha
Ligand
BDBM3185
Substrate
Histone type HL
Meas. Tech.
PKA assay
IC50
>50000±n/a nM
Citation
 Defauw, JMMurphy, MMJagdmann, GEHu, HLampe, JWHollinshead, SPMitchell, TJCrane, HMHeerding, JMMendoza, JSDavis, JEDarges, JWHubbard, FRHall, SE Synthesis and protein kinase C inhibitory activities of acyclic balanol analogs that are highly selective for protein kinase C over protein kinase A. J Med Chem 39:5215-27 (1996)  
Target
Name:
cAMP-dependent protein kinase catalytic subunit alpha
Synonyms:
KAPCA_BOVIN PKC Protein Kinase C cAMP-Dependent Protein Kinase (PKA) cAMP-dependent protein kinase A cAMP-dependent protein kinase, alpha-catalytic subunit
Type:
Enzyme Complex
Mol. Mass.:
40627.77
Organism:
Bos taurus (bovine)
Description:
The PKA holoenzyme purified from bovine heart, exists as an inactive tetrameric complex, which consists of a regulatory dimer associated with two catalytic subunits. It requires cAMP to activate the enzymatic reaction.
Residue:
351
  
Inhibitor
Name:
BDBM3185
Synonyms:
(+-)-2-[[2,6-Dihydroxy-4-[[[3-(4-hydroxyphenyl)-2-[(phenylsulfonyl)amino]propyl]oxy]carbonyl]phenyl]carbonyl]-3-hydroxybenzoic Acid Acyclic Balanol Analog 6b
Type:
Small organic molecule
Emp. Form.:
C30H25NO11S
Mol. Mass.:
607.585
SMILES:
OC(=O)c1cccc(O)c1C(=O)c1c(O)cc(cc1O)C(=O)OCC(Cc1ccc(O)cc1)NS(=O)(=O)c1ccccc1
:
Substrate
Name:
Histone type HL
Synonyms:
Type:
Peptide
Mol. Mass.:
358.43
Organism:
Description:
unfractionated histone (Worthington) 30 uM [gamma-32P]ATP as co-substrate.
Residue:
3
NA