Target
Protein kinase C epsilon type
Ligand
BDBM3189
Substrate
Lysine-rich histone
Meas. Tech.
PKC assay
IC50
39000±n/a nM
Citation
 Defauw, JMMurphy, MMJagdmann, GEHu, HLampe, JWHollinshead, SPMitchell, TJCrane, HMHeerding, JMMendoza, JSDavis, JEDarges, JWHubbard, FRHall, SE Synthesis and protein kinase C inhibitory activities of acyclic balanol analogs that are highly selective for protein kinase C over protein kinase A. J Med Chem 39:5215-27 (1996)  
Target
Name:
Protein kinase C epsilon type
Synonyms:
KPCE_HUMAN PKCE Protein kinase C epsilon Protein kinase C, PKC; classical/novel nPKC-epsilon
Type:
Enzyme
Mol. Mass.:
83680.45
Organism:
Homo sapiens (Human)
Description:
The recombinant human PKC enzymes were produced using a baculovirus expression system in SF9 cells
Residue:
737
  
Inhibitor
Name:
BDBM3189
Synonyms:
(+-)-2-[[2,6-Dihydroxy-4-[[[3-(4-hydroxyphenyl)-2-[(naphthylsulfonyl)amino]propyl]oxy]carbonyl]phenyl]carbonyl]-3-hydroxybenzoic Acid Acyclic Balanol Analog 16b
Type:
Small organic molecule
Emp. Form.:
C34H27NO11S
Mol. Mass.:
657.643
SMILES:
OC(=O)c1cccc(O)c1C(=O)c1c(O)cc(cc1O)C(=O)OCC(Cc1ccc(O)cc1)NS(=O)(=O)c1ccc2ccccc2c1
:
Substrate
Name:
Lysine-rich histone
Synonyms:
ING Peptide histone type IIIS
Type:
Peptide
Mol. Mass.:
10508.21
Organism:
Bos taurus (bovine)
Description:
Purified as a lysine rich fraction of histone H1 from calf thymus.
Residue:
105