Target
Protein kinase C beta type
Ligand
BDBM3202
Substrate
Lysine-rich histone
Meas. Tech.
PKC assay
IC50
20±n/a nM
Citation
 Defauw, JMMurphy, MMJagdmann, GEHu, HLampe, JWHollinshead, SPMitchell, TJCrane, HMHeerding, JMMendoza, JSDavis, JEDarges, JWHubbard, FRHall, SE Synthesis and protein kinase C inhibitory activities of acyclic balanol analogs that are highly selective for protein kinase C over protein kinase A. J Med Chem 39:5215-27 (1996)  
Target
Name:
Protein kinase C beta type
Synonyms:
KPCB_HUMAN PKC beta PKCB PRKCB1 Protein kinase C beta type | Protein kinase C beta type II (PRKCB2)
Type:
Enzyme
Mol. Mass.:
76873.67
Organism:
Homo sapiens (Human)
Description:
The recombinant human PKC enzymes were produced using a baculovirus expression system in SF9 cells
Residue:
671
  
Inhibitor
Name:
BDBM3202
Synonyms:
(+-)-anti-2-[[2,6-Dihydroxy-4-[[[2-(4-hydroxyphenyl)oxy]cyclopentyl]oxy]carbonyl]phenyl]carbonyl]-3-hydroxybenzoic acid Acyclic Balanol Analog 39b
Type:
Small organic molecule
Emp. Form.:
C26H22O10
Mol. Mass.:
494.4469
SMILES:
OC(=O)c1cccc(O)c1C(=O)c1c(O)cc(cc1O)C(=O)O[C@@H]1CCC[C@H]1Oc1ccc(O)cc1
:
Substrate
Name:
Lysine-rich histone
Synonyms:
ING Peptide histone type IIIS
Type:
Peptide
Mol. Mass.:
10508.21
Organism:
Bos taurus (bovine)
Description:
Purified as a lysine rich fraction of histone H1 from calf thymus.
Residue:
105