Target
Protein kinase C beta type
Ligand
BDBM3203
Substrate
Lysine-rich histone
Meas. Tech.
PKC assay
IC50
2200±n/a nM
Citation
 Defauw, JMMurphy, MMJagdmann, GEHu, HLampe, JWHollinshead, SPMitchell, TJCrane, HMHeerding, JMMendoza, JSDavis, JEDarges, JWHubbard, FRHall, SE Synthesis and protein kinase C inhibitory activities of acyclic balanol analogs that are highly selective for protein kinase C over protein kinase A. J Med Chem 39:5215-27 (1996)  
Target
Name:
Protein kinase C beta type
Synonyms:
KPCB_HUMAN PKC beta PKCB PRKCB1 Protein kinase C beta type | Protein kinase C beta type II (PRKCB2)
Type:
Enzyme
Mol. Mass.:
76873.67
Organism:
Homo sapiens (Human)
Description:
The recombinant human PKC enzymes were produced using a baculovirus expression system in SF9 cells
Residue:
671
  
Inhibitor
Name:
BDBM3203
Synonyms:
(2S)-2-benzenesulfonamido-3-(4-hydroxyphenyl)propyl 3,5-dihydroxy-4-{[2-hydroxy-6-(methoxycarbonyl)phenyl]carbonyl}benzoate Acyclic Balanol Analog 12c(S)
Type:
Small organic molecule
Emp. Form.:
C31H27NO11S
Mol. Mass.:
621.611
SMILES:
COC(=O)c1cccc(O)c1C(=O)c1c(O)cc(cc1O)C(=O)OC[C@H](Cc1ccc(O)cc1)NS(=O)(=O)c1ccccc1
:
Substrate
Name:
Lysine-rich histone
Synonyms:
ING Peptide histone type IIIS
Type:
Peptide
Mol. Mass.:
10508.21
Organism:
Bos taurus (bovine)
Description:
Purified as a lysine rich fraction of histone H1 from calf thymus.
Residue:
105