Target
5-hydroxytryptamine receptor 2A
Ligand
BDBM22913
Substrate
Ki
1900±n/a nM
Comments
PDSP_2292
Citation
 Leurs, RTulp, MTMenge, WMAdolfs, MJZuiderveld, OPTimmerman, H Evaluation of the receptor selectivity of the H3 receptor antagonists, iodophenpropit and thioperamide: an interaction with the 5-HT3 receptor revealed. Br J Pharmacol 116:2315-21 (1995)  
Target
Name:
5-hydroxytryptamine receptor 2A
Synonyms:
5-HT-2A 5-HT2A 5-hydroxytryptamine receptor 2A (5HT2A) Htr2 Serotonin Receptor 2A
Type:
G Protein-Coupled Receptor (GPCR)
Mol. Mass.:
52852.05
Organism:
Rattus norvegicus (rat)
Description:
Rat cortex membranes 5-HT2A receptors.
Residue:
471
  
Inhibitor
Name:
BDBM22913
Synonyms:
CHEMBL1237146 Iodophenpropit | {[3-(1H-imidazol-5-yl)propyl]sulfanyl}-N''-[2-(4-iodophenyl)ethyl]methanimidamide
Type:
Small organic molecule
Emp. Form.:
C15H19IN4S
Mol. Mass.:
414.308
SMILES:
NC(SCCCc1cnc[nH]1)=NCCc1ccc(I)cc1
: