Target
Mu-type opioid receptor
Ligand
BDBM22913
Substrate
Ki
8400±n/a nM
Comments
PDSP_2292
Citation
 Leurs, RTulp, MTMenge, WMAdolfs, MJZuiderveld, OPTimmerman, H Evaluation of the receptor selectivity of the H3 receptor antagonists, iodophenpropit and thioperamide: an interaction with the 5-HT3 receptor revealed. Br J Pharmacol 116:2315-21 (1995)  
Target
Name:
Mu-type opioid receptor
Synonyms:
MOR-1 Mu-type opioid receptor (MOR) OPRM_RAT Opioid receptor B Ror-b
Type:
G Protein-Coupled Receptor (GPCR)
Mol. Mass.:
44503.11
Organism:
Rattus norvegicus (rat)
Description:
Competition binding assays were carried out using membrane preparations from transfected HN9.10 cells that constitutively expressed the mu opioid receptor.
Residue:
398
  
Inhibitor
Name:
BDBM22913
Synonyms:
CHEMBL1237146 Iodophenpropit | {[3-(1H-imidazol-5-yl)propyl]sulfanyl}-N''-[2-(4-iodophenyl)ethyl]methanimidamide
Type:
Small organic molecule
Emp. Form.:
C15H19IN4S
Mol. Mass.:
414.308
SMILES:
NC(SCCCc1cnc[nH]1)=NCCc1ccc(I)cc1
: