Target
5-hydroxytryptamine receptor 2B
Ligand
BDBM84930
Substrate
Ki
1.63±n/a nM
Comments
PDSP_1151
Citation
 Wainscott, DBLucaites, VLKursar, JDBaez, MNelson, DL Pharmacologic characterization of the human 5-hydroxytryptamine2B receptor: evidence for species differences. J Pharmacol Exp Ther 276:720-7 (1996) Target
Name:
5-hydroxytryptamine receptor 2B
Synonyms:
5-HT-2B 5-hydroxytryptamine (serotonin) receptor 2B [Homo sapiens] 5-hydroxytryptamine receptor 2C (5HT2C) HTR2B Serotonin 2b (5-HT2b) receptor | Serotonin Receptor 2B
Type:
G Protein-Coupled Receptor (GPCR)
Mol. Mass.:
54312.47
Organism:
Homo sapiens (Human)
Description:
Receptor binding assays were performed using human clone stably expressed in CHO cells.
Residue:
481
  
Inhibitor
Name:
BDBM84930
Synonyms:
CAS_60634-51-7 NSC_107989
Type:
Small organic molecule
Emp. Form.:
C23H32N2O3
Mol. Mass.:
384.5118
SMILES:
CC(O)C(C)OC(=O)C1CC2C(Cc3cn(C(C)C)c4cccc2c34)N(C)C1
: