Target
5-hydroxytryptamine receptor 2B
Ligand
BDBM82472
Substrate
Ki
12.59±n/a nM
Comments
PDSP_456
Citation
 Kennett, GABright, FTrail, BBaxter, GSBlackburn, TP Effects of the 5-HT2B receptor agonist, BW 723C86, on three rat models of anxiety. Br J Pharmacol 117:1443-8 (1996)  
Target
Name:
5-hydroxytryptamine receptor 2B
Synonyms:
5-HT2B 5HT2B_RAT Serotonin 2b (5-HT2b) receptor Srl
Type:
Enzyme Catalytic Domain
Mol. Mass.:
53668.47
Organism:
RAT
Description:
5-HT2B HTR2B RAT::P30994
Residue:
479
  
Inhibitor
Name:
BDBM82472
Synonyms:
BW-723C86 NSC_5311036
Type:
Small organic molecule
Emp. Form.:
C16H18N2OS
Mol. Mass.:
286.392
SMILES:
CC(N)Cc1c[nH]c2ccc(OCc3cccs3)cc12
: