Target
Mitogen-activated protein kinase 14
Ligand
BDBM15236
Substrate
Meas. Tech.
Kinase Assay
Temperature
310.15±0 K
IC50
1.64e+3± 2e+2 nM
Citation
 Goettert, MSchattel, VKoch, PMerfort, ILaufer, S Biological evaluation and structural determinants of p38α mitogen-activated-protein kinase and c-Jun-N-terminal kinase 3 inhibition by flavonoids. Chembiochem 11:2579-88 (2010)  
Target
Name:
Mitogen-activated protein kinase 14
Synonyms:
CSAID-binding protein CSBP1 CSPB1 MAP kinase 14 MAP kinase p38 alpha MAPK14 MK14_HUMAN Mitogen-activated protein kinase p38 alpha Stress-activated protein kinase 2a | p38 MAP kinase alpha/beta
Type:
Serine/threonine-protein kinase
Mol. Mass.:
41286.76
Organism:
Homo sapiens (Human)
Description:
Q16539
Residue:
360
  
Inhibitor
Name:
BDBM15236
Synonyms:
3,5,7-trihydroxy-2-(3,4,5-trihydroxyphenyl)-4H-chromen-4-one CHEMBL164 Myricetin Myricetin (Myr) | cid_5281672
Type:
Small organic molecule
Emp. Form.:
C15H10O8
Mol. Mass.:
318.2351
SMILES:
Oc1cc(O)c2c(c1)oc(-c1cc(O)c(O)c(O)c1)c(O)c2=O
: