Target
Mitogen-activated protein kinase 10
Ligand
BDBM84983
Substrate
Meas. Tech.
Kinase Assay
Temperature
310.15±0 K
IC50
7.8e+3± 1e+2 nM
Citation
 Goettert, MSchattel, VKoch, PMerfort, ILaufer, S Biological evaluation and structural determinants of p38α mitogen-activated-protein kinase and c-Jun-N-terminal kinase 3 inhibition by flavonoids. Chembiochem 11:2579-88 (2010)  
Target
Name:
Mitogen-activated protein kinase 10
Synonyms:
JNK3 MAP kinase p49 3F12 MK10_HUMAN Mitogen-activated protein kinase 10 (Stress-activated protein kinase JNK3) (c-Jun N-terminal kinase 3) (MAP kinase p49 3F12) PRKM10 Stress-activated protein kinase JNK3 | c-Jun N-terminal kinase 3 (JNK3)
Type:
Enzyme
Mol. Mass.:
52586.89
Organism:
Homo sapiens (Human)
Description:
Residue:
464
  
Inhibitor
Name:
BDBM84983
Synonyms:
Velutin
Type:
Small organic molecule
Emp. Form.:
C17H14O6
Mol. Mass.:
314.2895
SMILES:
COc1cc(O)c2c(c1)oc(cc2=O)-c1ccc(O)c(OC)c1
: