Target
5-hydroxytryptamine receptor 2B
Ligand
BDBM82272
Substrate
Ki
63.10±n/a nM
Comments
PDSP_7268
Citation
 Baxter, GS Novel discriminatory ligands for 5-HT2B receptors. Behav Brain Res 73:149-52 (1996)  
Target
Name:
5-hydroxytryptamine receptor 2B
Synonyms:
5-HT2B 5HT2B_RAT Serotonin 2b (5-HT2b) receptor Srl
Type:
Enzyme Catalytic Domain
Mol. Mass.:
53668.47
Organism:
RAT
Description:
5-HT2B HTR2B RAT::P30994
Residue:
479
  
Inhibitor
Name:
BDBM82272
Synonyms:
SB 200646 | SB200646a
Type:
Emp. Form.:
C15H14N4O
Mol. Mass.:
266.2979
SMILES:
Cn1ccc2cc(NC(=O)Nc3cccnc3)ccc12
: