Target
5-hydroxytryptamine receptor 2B
Ligand
BDBM84991
Substrate
Ki
15.85±n/a nM
Comments
PDSP_1673
Citation
 Baxter, GS Novel discriminatory ligands for 5-HT2B receptors. Behav Brain Res 73:149-52 (1996)  
Target
Name:
5-hydroxytryptamine receptor 2B
Synonyms:
5-HT2B 5HT2B_RAT Serotonin 2b (5-HT2b) receptor Srl
Type:
Enzyme Catalytic Domain
Mol. Mass.:
53668.47
Organism:
RAT
Description:
5-HT2B HTR2B RAT::P30994
Residue:
479
  
Inhibitor
Name:
BDBM84991
Synonyms:
CAS_3277600 SB204741
Type:
Small organic molecule
Emp. Form.:
C14H14N4OS
Mol. Mass.:
286.352
SMILES:
Cc1cc(NC(=O)Nc2ccc3n(C)ccc3c2)sn1
: