Target
D(3) dopamine receptor
Ligand
BDBM84991
Substrate
Ki
>10000±n/a nM
Comments
PDSP_1673
Citation
 Baxter, GS Novel discriminatory ligands for 5-HT2B receptors. Behav Brain Res 73:149-52 (1996)  
Target
Name:
D(3) dopamine receptor
Synonyms:
DOPAMINE D3 DRD3_HUMAN Dopamine D3 receptor (D3) Dopamine receptor Dopamine receptor D3
Type:
Mol. Mass.:
44243.43
Organism:
Homo sapiens (Human)
Description:
Residue:
400
  
Inhibitor
Name:
BDBM84991
Synonyms:
CAS_3277600 SB204741
Type:
Small organic molecule
Emp. Form.:
C14H14N4OS
Mol. Mass.:
286.352
SMILES:
Cc1cc(NC(=O)Nc2ccc3n(C)ccc3c2)sn1
: