Target
Sodium-dependent serotonin transporter
Ligand
BDBM77970
Substrate
Ki
0.14±n/a nM
Comments
PDSP_541
Citation
 Pälvimäki, EPRoth, BLMajasuo, HLaakso, AKuoppamäki, MSyvälahti, EHietala, J Interactions of selective serotonin reuptake inhibitors with the serotonin 5-HT2c receptor. Psychopharmacology (Berl) 126:234-40 (1996)  
Target
Name:
Sodium-dependent serotonin transporter
Synonyms:
5-HT Transporter 5HT transporter Anandamid membrane transporter, AMT Monoamine transporters; Norepinephrine & serotonin Slc6a4 Sodium-dependent serotonin transporter (SERT) | imipramine receptor
Type:
Multi-pass membrane protein
Mol. Mass.:
70168.43
Organism:
Rattus norvegicus (rat)
Description:
P31652
Residue:
630
  
Inhibitor
Name:
BDBM77970
Synonyms:
3-(2-chloranyl-5,6-dihydrobenzo[b][1]benzazepin-11-yl)-N,N-dimethyl-propan-1-amine;hydrochloride 3-(2-chloro-5,6-dihydrobenzo[b][1]benzazepin-11-yl)-N,N-dimethylpropan-1-amine;hydrochloride CHLORIMIPRAMINE CLOMIPRAMINE HYDROCHLORIDE MLS000028511 cid_68539 | med.21724, Compound Clomipramine
Type:
Small organic molecule
Emp. Form.:
C19H23ClN2
Mol. Mass.:
314.852
SMILES:
CN(C)CCCN1c2ccccc2CCc2ccc(Cl)cc12
: