Target
Sodium-dependent serotonin transporter
Ligand
BDBM50020706
Substrate
Ki
67.6±n/a nM
Comments
PDSP_1995
Citation
 Pälvimäki, EPRoth, BLMajasuo, HLaakso, AKuoppamäki, MSyvälahti, EHietala, J Interactions of selective serotonin reuptake inhibitors with the serotonin 5-HT2c receptor. Psychopharmacology (Berl) 126:234-40 (1996)  
Target
Name:
Sodium-dependent serotonin transporter
Synonyms:
5-HT Transporter 5HT transporter Anandamid membrane transporter, AMT Monoamine transporters; Norepinephrine & serotonin Slc6a4 Sodium-dependent serotonin transporter (SERT) | imipramine receptor
Type:
Multi-pass membrane protein
Mol. Mass.:
70168.43
Organism:
Rattus norvegicus (rat)
Description:
P31652
Residue:
630
  
Inhibitor
Name:
BDBM50020706
Synonyms:
CHEMBL37744 Zimeldine [3-(4-Bromo-phenyl)-3-pyridin-3-yl-allyl]-dimethyl-amine (Zimelidine) cis -[3-(4-Bromo-phenyl)-3-pyridin-3-yl-allyl]-dimethyl-amine;HCl | trans-[3-(4-Bromo-phenyl)-3-pyridin-3-yl-allyl]-dimethyl-amine;C2H4O4
Type:
Small organic molecule
Emp. Form.:
C16H17BrN2
Mol. Mass.:
317.224
SMILES:
CN(C)C\C=C(\c1ccc(Br)cc1)c1cccnc1
: