Target
5-hydroxytryptamine receptor 2A
Ligand
BDBM50020706
Substrate
Ki
1000±n/a nM
Comments
PDSP_1995
Citation
 Pälvimäki, EPRoth, BLMajasuo, HLaakso, AKuoppamäki, MSyvälahti, EHietala, J Interactions of selective serotonin reuptake inhibitors with the serotonin 5-HT2c receptor. Psychopharmacology (Berl) 126:234-40 (1996)  
Target
Name:
5-hydroxytryptamine receptor 2A
Synonyms:
5-HT-2A 5-HT2A 5-hydroxytryptamine receptor 2A (5HT2A) Htr2 Serotonin Receptor 2A
Type:
G Protein-Coupled Receptor (GPCR)
Mol. Mass.:
52852.05
Organism:
Rattus norvegicus (rat)
Description:
Rat cortex membranes 5-HT2A receptors.
Residue:
471
  
Inhibitor
Name:
BDBM50020706
Synonyms:
CHEMBL37744 Zimeldine [3-(4-Bromo-phenyl)-3-pyridin-3-yl-allyl]-dimethyl-amine (Zimelidine) cis -[3-(4-Bromo-phenyl)-3-pyridin-3-yl-allyl]-dimethyl-amine;HCl | trans-[3-(4-Bromo-phenyl)-3-pyridin-3-yl-allyl]-dimethyl-amine;C2H4O4
Type:
Small organic molecule
Emp. Form.:
C16H17BrN2
Mol. Mass.:
317.224
SMILES:
CN(C)C\C=C(\c1ccc(Br)cc1)c1cccnc1
: