Target
Voltage-dependent T-type calcium channel subunit alpha-1H
Ligand
BDBM50049750
Substrate
Ki
>10000±n/a nM
Comments
PDSP_218
Citation
 Sullivan, JPDonnelly-Roberts, DBriggs, CAAnderson, DJGopalakrishnan, MPiattoni-Kaplan, MCampbell, JEMcKenna, DGMolinari, EHettinger, AMGarvey, DSWasicak, JTHolladay, MWWilliams, MArneric, SP A-85380 [3-(2(S)-azetidinylmethoxy) pyridine]: in vitro pharmacological properties of a novel, high affinity alpha 4 beta 2 nicotinic acetylcholine receptor ligand. Neuropharmacology 35:725-34 (1996)  
Target
Name:
Voltage-dependent T-type calcium channel subunit alpha-1H
Synonyms:
CAC1H_HUMAN Low-voltage-activated calcium channel alpha1 3.2 subunit Voltage-gated calcium channel voltage-dependent T-type calcium channel subunit alpha-1H isoform a
Type:
Enzyme Catalytic Domain
Mol. Mass.:
259187.68
Organism:
Homo sapiens (Human)
Description:
Calcium channel (Type T,L) 0 0::O95180
Residue:
2353
  
Inhibitor
Name:
BDBM50049750
Synonyms:
(S)-3-(azetidin-2-ylmethoxy)pyridine A-159470 CHEMBL59986
Type:
Small organic molecule
Emp. Form.:
C9H12N2O
Mol. Mass.:
164.2044
SMILES:
C(Oc1cccnc1)[C@@H]1CCN1
: