Target
Gamma-aminobutyric acid receptor subunit alpha-3
Ligand
BDBM50026756
Substrate
Ki
3460±n/a nM
Comments
PDSP_534
Citation
 Araujo, FTan, SRuano, DSchoemaker, HBenavides, JVitorica, J Molecular and pharmacological characterization of native cortical gamma-aminobutyric acidA receptors containing both alpha1 and alpha3 subunits. J Biol Chem 271:27902-11 (1996)  
Target
Name:
Gamma-aminobutyric acid receptor subunit alpha-3
Synonyms:
GABA A anti-Alpha3 GABA receptor alpha-3 subunit Gabra-3 Gamma-aminobutyric acid receptor subunit alpha-3
Type:
Enzyme Catalytic Domain
Mol. Mass.:
55444.88
Organism:
RAT
Description:
GABA A Alpha3Beta2Gamma2 0 RAT::P20236
Residue:
493
  
Inhibitor
Name:
BDBM50026756
Synonyms:
3-Methyl-6-(3-trifluoromethyl-phenyl)-[1,2,4]triazolo[4,3-b]pyridazine CI-218872 CL218,872 | v3-Methyl-6-(3-trifluoromethyl-phenyl)-[1,2,4]triazolo[4,3-b]pyridazine
Type:
Small organic molecule
Emp. Form.:
C13H9F3N4
Mol. Mass.:
278.2326
SMILES:
Cc1nnc2ccc(nn12)-c1cccc(c1)C(F)(F)F
: