Target
Alpha-2B adrenergic receptor
Ligand
BDBM84994
Substrate
Ki
0.49±n/a nM
Comments
PDSP_1422
Citation
 Schotte, AJanssen, PFGommeren, WLuyten, WHVan Gompel, PLesage, ASDe Loore, KLeysen, JE Risperidone compared with new and reference antipsychotic drugs: in vitro and in vivo receptor binding. Psychopharmacology (Berl) 124:57-73 (1996)  
Target
Name:
Alpha-2B adrenergic receptor
Synonyms:
ADA2B_HUMAN ADRA2L1 Adrenergic alpha2B Adrenergic receptor alpha Alpha-2 adrenergic receptor subtype C2 Alpha-2B adrenoreceptor | Alpha-2BAR
Type:
Enzyme
Mol. Mass.:
49964.20
Organism:
Homo sapiens (Human)
Description:
P18089
Residue:
450
  
Inhibitor
Name:
BDBM84994
Synonyms:
CAS_163091 ORG-5222
Type:
Small organic molecule
Emp. Form.:
C17H16ClNO
Mol. Mass.:
285.768
SMILES:
CN1CC2C(C1)c1cc(Cl)ccc1Oc1ccccc21
: