Target
Histamine H1 receptor
Ligand
BDBM24226
Substrate
Ki
0.8±n/a nM
Comments
PDSP_329
Citation
 Schotte, AJanssen, PFGommeren, WLuyten, WHVan Gompel, PLesage, ASDe Loore, KLeysen, JE Risperidone compared with new and reference antipsychotic drugs: in vitro and in vivo receptor binding. Psychopharmacology (Berl) 124:57-73 (1996)  
Target
Name:
Histamine H1 receptor
Synonyms:
H1R HISTAMINE H1 HRH1_HUMAN
Type:
G Protein-Coupled Receptor (GPCR)
Mol. Mass.:
55808.72
Organism:
Homo sapiens (Human)
Description:
Cell pellets from SK-N-MC cells transfected with human H1 receptor were used in binding assay.
Residue:
487
  
Inhibitor
Name:
BDBM24226
Synonyms:
1-[(4-fluorophenyl)methyl]-N-{1-[2-(4-methoxyphenyl)ethyl]piperidin-4-yl}-1H-1,3-benzodiazol-2-amine Astemizole, [O-Methyl-3H] Hismanal [3H]-ASTEMIZOLE cid_2247 | med.21724, Compound Astemizole
Type:
Radiolabeled ligand
Emp. Form.:
C28H31FN4O
Mol. Mass.:
458.5703
SMILES:
COc1ccc(CCN2CCC(CC2)Nc2nc3ccccc3n2Cc2ccc(F)cc2)cc1
: