Target
Thromboxane A2 receptor
Ligand
BDBM81483
Substrate
Ki
1000±n/a nM
Comments
PDSP_1499
Citation
 Schotte, AJanssen, PFGommeren, WLuyten, WHVan Gompel, PLesage, ASDe Loore, KLeysen, JE Risperidone compared with new and reference antipsychotic drugs: in vitro and in vivo receptor binding. Psychopharmacology (Berl) 124:57-73 (1996)  
Target
Name:
Thromboxane A2 receptor
Synonyms:
Prostanoid TP receptor TBXA2R Thromboxane Thromboxane Beta
Type:
Enyzme
Mol. Mass.:
37445.28
Organism:
Homo sapiens (Human)
Description:
P21731
Residue:
343
  
Inhibitor
Name:
BDBM81483
Synonyms:
CAS_1893-33-0 PIPAMPERONE
Type:
Small organic molecule
Emp. Form.:
C21H30FN3O2
Mol. Mass.:
375.4802
SMILES:
NC(=O)C1(CCN(CCCC(=O)c2ccc(F)cc2)CC1)N1CCCCC1
: