Target
5-hydroxytryptamine receptor 4
Ligand
BDBM85019
Substrate
Ki
1.38±n/a nM
Comments
PDSP_1604
Citation
 Claeysen, SSebben, MJournot, LBockaert, JDumuis, A Cloning, expression and pharmacology of the mouse 5-HT(4L) receptor. FEBS Lett 398:19-25 (1996)  
Target
Name:
5-hydroxytryptamine receptor 4
Synonyms:
5-HT-4 5-HT4L 5HT4R_MOUSE Serotonin 4 (5-HT4) receptor | Serotonin receptor 4
Type:
Enzyme Catalytic Domain
Mol. Mass.:
43970.99
Organism:
MOUSE
Description:
5-HT4 HTR4 MOUSE::P97288
Residue:
388
  
Inhibitor
Name:
BDBM85019
Synonyms:
4-Amino-5-chloro-N-(1-{4-[4-(dimethylamino)-1-piperidinyl]-4-oxobutyl}-3-methoxy-4-piperidinyl)-2-methoxybenzamide | RN 76186
Type:
Small organic molecule
Emp. Form.:
C25H40ClN5O4
Mol. Mass.:
510.069
SMILES:
COC1CN(CCCC(=O)N2CCC(CC2)N(C)C)CCC1NC(=O)c1cc(Cl)c(N)cc1OC
: