Target
5-hydroxytryptamine receptor 1B
Ligand
BDBM81790
Substrate
Ki
>10000±n/a nM
Comments
PDSP_287
Citation
 Schoemaker, HClaustre, YFage, DRouquier, LChergui, KCuret, OOblin, AGonon, FCarter, CBenavides, JScatton, B Neurochemical characteristics of amisulpride, an atypical dopamine D2/D3 receptor antagonist with both presynaptic and limbic selectivity. J Pharmacol Exp Ther 280:83-97 (1997) Target
Name:
5-hydroxytryptamine receptor 1B
Synonyms:
5-HT-1B 5-hydroxytryptamine receptor 1B (5HT1B) 5ht1b Serotonin 1 (5-HT1) receptor Serotonin receptor 1B
Type:
Protein
Mol. Mass.:
43173.33
Organism:
Rattus norvegicus (Rat)
Description:
P28564
Residue:
386
  
Inhibitor
Name:
BDBM81790
Synonyms:
Amisulpride NSC_2159 US10259786, Amisulpride
Type:
Small organic molecule
Emp. Form.:
C17H27N3O4S
Mol. Mass.:
369.479
SMILES:
CCN1CCCC1CNC(=O)c1cc(c(N)cc1OC)S(=O)(=O)CC
: