Target
Adenosine receptor A3
Ligand
BDBM21173
Substrate
Ki
1120±n/a nM
Comments
PDSP_739
Citation
 Hill, RJOleynek, JJHoth, CFKiron, MAWeng, WWester, RTTracey, WRKnight, DRBuchholz, RAKennedy, SP Cloning, expression and pharmacological characterization of rabbit adenosine A1 and A3 receptors. J Pharmacol Exp Ther 280:122-8 (1997) Target
Name:
Adenosine receptor A3
Synonyms:
AA3R_RABIT ADORA3
Type:
Protein
Mol. Mass.:
36319.35
Organism:
Oryctolagus cuniculus (rabbit)
Description:
O02667
Residue:
319
  
Inhibitor
Name:
BDBM21173
Synonyms:
1,3-dipropyl-8-cyclopentylxanthine CHEMBL183 PD116948 | [3H]DPCPX
Type:
radiolabeled ligand
Emp. Form.:
C16H24N4O2
Mol. Mass.:
304.3874
SMILES:
CCCn1c2nc([nH]c2c(=O)n(CCC)c1=O)C1CCCC1
: