Target
Adenosine receptor A3
Ligand
BDBM50034171
Substrate
Ki
2±n/a nM
Comments
PDSP_947
Citation
 Hill, RJOleynek, JJHoth, CFKiron, MAWeng, WWester, RTTracey, WRKnight, DRBuchholz, RAKennedy, SP Cloning, expression and pharmacological characterization of rabbit adenosine A1 and A3 receptors. J Pharmacol Exp Ther 280:122-8 (1997) Target
Name:
Adenosine receptor A3
Synonyms:
AA3R_RABIT ADORA3
Type:
Protein
Mol. Mass.:
36319.35
Organism:
Oryctolagus cuniculus (rabbit)
Description:
O02667
Residue:
319
  
Inhibitor
Name:
BDBM50034171
Synonyms:
3,4-Dihydroxy-5-[6-(3-iodo-benzylamino)-purin-9-yl]-tetrahydro-furan-2-carboxylic acid methylamide IB-MECA
Type:
Small organic molecule
Emp. Form.:
C18H19IN6O4
Mol. Mass.:
510.2857
SMILES:
CNC(=O)C1OC(C(O)C1O)n1cnc2c(NCc3cccc(I)c3)ncnc12
: