Target
Adenosine receptor A3
Ligand
BDBM21220
Substrate
Ki
27±n/a nM
Comments
PDSP_1302
Citation
 Hill, RJOleynek, JJHoth, CFKiron, MAWeng, WWester, RTTracey, WRKnight, DRBuchholz, RAKennedy, SP Cloning, expression and pharmacological characterization of rabbit adenosine A1 and A3 receptors. J Pharmacol Exp Ther 280:122-8 (1997) Target
Name:
Adenosine receptor A3
Synonyms:
AA3R_RABIT ADORA3
Type:
Protein
Mol. Mass.:
36319.35
Organism:
Oryctolagus cuniculus (rabbit)
Description:
O02667
Residue:
319
  
Inhibitor
Name:
BDBM21220
Synonyms:
(2S,3S,4R,5R)-5-(6-amino-9H-purin-9-yl)-N-ethyl-3,4-dihydroxyoxolane-2-carboxamide Adenosine, N6-Ethyl-carboxamido CHEMBL464859 NECA
Type:
Antineoplastic Agent
Emp. Form.:
C12H16N6O4
Mol. Mass.:
308.2932
SMILES:
CCNC(=O)[C@H]1O[C@H]([C@H](O)[C@@H]1O)n1cnc2c(N)ncnc12
: