Target
5-hydroxytryptamine receptor 2A
Ligand
BDBM50034043
Substrate
Ki
5.6±n/a nM
Comments
PDSP_964
Citation
 Kongsamut, SRoehr, JECai, JHartman, HBWeissensee, PKerman, LLTang, LSandrasagra, A Iloperidone binding to human and rat dopamine and 5-HT receptors. Eur J Pharmacol 317:417-23 (1996)  
Target
Name:
5-hydroxytryptamine receptor 2A
Synonyms:
5-HT-2 5-HT2A 5-hydroxytryptamine receptor 2A (5HT-2A) 5HT2A_HUMAN HTR2A | Serotonin receptor 2A
Type:
undefined
Mol. Mass.:
52607.65
Organism:
Homo sapiens (Human)
Description:
P28223
Residue:
471
  
Inhibitor
Name:
BDBM50034043
Synonyms:
1-(4-{3-[4-(6-Fluoro-benzo[d]isoxazol-3-yl)-piperidin-1-yl]-propoxy}-3-methoxy-phenyl)-ethanone ILOPERIDONE
Type:
Small organic molecule
Emp. Form.:
C24H27FN2O4
Mol. Mass.:
426.4806
SMILES:
COc1cc(ccc1OCCCN1CCC(CC1)c1noc2cc(F)ccc12)C(C)=O
: