Target
Gamma-aminobutyric acid receptor subunit alpha-6
Ligand
BDBM85038
Substrate
Ki
23±n/a nM
Comments
PDSP_1565
Citation
 Gunnersen, DKaufman, CMSkolnick, P Pharmacological properties of recombinant "diazepam-insensitive" GABAA receptors. Neuropharmacology 35:1307-14 (1996)  
Target
Name:
Gamma-aminobutyric acid receptor subunit alpha-6
Synonyms:
GABA A Alpha6Beta3Gamma2 GABA receptor alpha-6 subunit Gabra-6 Gamma-aminobutyric acid receptor subunit alpha-6
Type:
Enzyme Catalytic Domain
Mol. Mass.:
51188.24
Organism:
RAT
Description:
GABA A Alpha6Beta2Gamma2 0 RAT::P30191
Residue:
453
  
Inhibitor
Name:
BDBM85038
Synonyms:
CHEMBL43948 | PZII-029
Type:
Small organic molecule
Emp. Form.:
C18H15N3O3
Mol. Mass.:
321.33
SMILES:
COc1ccc(cc1)-n1[nH]c2c(cnc3cc(OC)ccc23)c1=O
: