Target
5-hydroxytryptamine receptor 2A
Ligand
BDBM50102325
Substrate
Ki
30±n/a nM
Comments
PDSP_1455
Citation
 Seeman, PCorbett, RVan Tol, HH Atypical neuroleptics have low affinity for dopamine D2 receptors or are selective for D4 receptors. Neuropsychopharmacology 16:93 (1997)  
Target
Name:
5-hydroxytryptamine receptor 2A
Synonyms:
5-HT-2 5-HT2A 5-hydroxytryptamine receptor 2A (5HT-2A) 5HT2A_HUMAN HTR2A | Serotonin receptor 2A
Type:
undefined
Mol. Mass.:
52607.65
Organism:
Homo sapiens (Human)
Description:
P28223
Residue:
471
  
Inhibitor
Name:
BDBM50102325
Synonyms:
6-(4-Methyl-piperazin-1-yl)-11H-dibenzo[b,e]azepine Perlapine
Type:
Small organic molecule
Emp. Form.:
C19H21N3
Mol. Mass.:
291.3901
SMILES:
CN1CCN(CC1)C1=Nc2ccccc2Cc2ccccc12
: