Target
D(4) dopamine receptor
Ligand
BDBM81771
Substrate
Ki
410±n/a nM
Comments
PDSP_1200
Citation
 Seeman, PCorbett, RVan Tol, HH Atypical neuroleptics have low affinity for dopamine D2 receptors or are selective for D4 receptors. Neuropsychopharmacology 16:93 (1997)  
Target
Name:
D(4) dopamine receptor
Synonyms:
D(2C) dopamine receptor DOPAMINE D4.2 DRD4 Dopamine D4 receptor
Type:
Enzyme
Mol. Mass.:
48373.19
Organism:
Homo sapiens (Human)
Description:
P21917
Residue:
419
  
Inhibitor
Name:
BDBM81771
Synonyms:
CAS_3575-80-2 NSC_15387
Type:
Small organic molecule
Emp. Form.:
C16H22FNO
Mol. Mass.:
263.3504
SMILES:
CC1CCN(CCCC(=O)c2ccc(F)cc2)CC1
: