Target
D(4) dopamine receptor
Ligand
BDBM50102325
Substrate
Ki
30±n/a nM
Comments
PDSP_1455
Citation
 Seeman, PCorbett, RVan Tol, HH Atypical neuroleptics have low affinity for dopamine D2 receptors or are selective for D4 receptors. Neuropsychopharmacology 16:93 (1997)  
Target
Name:
D(4) dopamine receptor
Synonyms:
D(2C) dopamine receptor DOPAMINE D4.2 DRD4 Dopamine D4 receptor
Type:
Enzyme
Mol. Mass.:
48373.19
Organism:
Homo sapiens (Human)
Description:
P21917
Residue:
419
  
Inhibitor
Name:
BDBM50102325
Synonyms:
6-(4-Methyl-piperazin-1-yl)-11H-dibenzo[b,e]azepine Perlapine
Type:
Small organic molecule
Emp. Form.:
C19H21N3
Mol. Mass.:
291.3901
SMILES:
CN1CCN(CC1)C1=Nc2ccccc2Cc2ccccc12
: