Target
Neurotensin
Ligand
BDBM50248034
Substrate
Ki
3.9±n/a nM
Comments
PDSP_1754
Citation
 Gully, DLabeeuw, BBoigegrain, ROury-Donat, FBachy, APoncelet, MSteinberg, RSuaud-Chagny, MFSantucci, VVita, NPecceu, FLabbé-Jullié, CKitabgi, PSoubrié, PLe Fur, GMaffrand, JP Biochemical and pharmacological activities of SR 142948A, a new potent neurotensin receptor antagonist. J Pharmacol Exp Ther 280:802-12 (1997) Target
Name:
Neurotensin
Synonyms:
NEUT_CAVPO NTS | Neurotensin
Type:
Enzyme Catalytic Domain
Mol. Mass.:
1681.93
Organism:
GUINEA PIG
Description:
NT 0 GUINEA PIG::P32560
Residue:
13
QLYENKSRRPYIL
  
Inhibitor
Name:
BDBM50248034
Synonyms:
2-{[1-(7-Chloro-quinolin-4-yl)-5-(2,6-dimethoxy-phenyl)-1H-pyrazole-3-carbonyl]-amino}-adamantane-2-carboxylic acid SR 48692
Type:
Small organic molecule
Emp. Form.:
C32H31ClN4O5
Mol. Mass.:
587.065
SMILES:
COc1cccc(OC)c1-c1cc(nn1-c1ccnc2cc(Cl)ccc12)C(=O)NC1(C2CC3CC(C2)CC1C3)C(O)=O
: