Target
Nitric oxide synthase, inducible
Ligand
BDBM275052
Substrate
Meas. Tech.
Caco-2 Assay
Ki
2000±n/a nM
Citation
 Silverman, RBMukherjee, PNguyen, HM 2-imidazolyl-pyrimidine scaffolds as potent and selective inhibitors of neuronal nitric oxide synthase US Patent  US9878996 Publication Date 1/30/2018 
Target
Name:
Nitric oxide synthase, inducible
Synonyms:
HEP-NOS Inducible NO synthase NOS type II NOS2A Nitric oxide synthase, inducible (iNOS) | iNOS
Type:
Homodimer
Mol. Mass.:
131141.95
Organism:
Homo sapiens (Human)
Description:
P35228
Residue:
1153
  
Inhibitor
Name:
BDBM275052
Synonyms:
US9878996, Compound 25
Type:
Small organic molecule
Emp. Form.:
C18H20ClN5
Mol. Mass.:
341.838
SMILES:
Clc1cccc(CCCNCCc2ccnc(n2)-n2ccnc2)c1
: