Target
Galanin receptor type 1
Ligand
BDBM50307254
Substrate
Ki
0.9±n/a nM
Comments
PDSP_1162
Citation
 Howard, ADTan, CShiao, LLPalyha, OCMcKee, KKWeinberg, DHFeighner, SDCascieri, MASmith, RGVan Der Ploeg, LHSullivan, KA Molecular cloning and characterization of a new receptor for galanin. FEBS Lett 405:285-90 (1997)  
Target
Name:
Galanin receptor type 1
Synonyms:
GALR1_RAT Galanin receptor type 1 Galnr1 | Galr1
Type:
Enzyme Catalytic Domain
Mol. Mass.:
38883.91
Organism:
RAT
Description:
Galanin R1 GALR1 RAT::Q62805
Residue:
346
  
Inhibitor
Name:
BDBM50307254
Synonyms:
CHEMBL604990 M40
Type:
Small organic molecule
Emp. Form.:
C94H145N23O24
Mol. Mass.:
1981.2968
SMILES:
CC(C)C[C@H](NC(=O)[C@H](CC(C)C)NC(=O)[C@H](Cc1ccc(O)cc1)NC(=O)CNC(=O)[C@H](C)NC(=O)[C@H](CO)NC(=O)[C@H](CC(N)=O)NC(=O)[C@H](CC(C)C)NC(=O)[C@@H](NC(=O)[C@H](Cc1c[nH]c2ccccc12)NC(=O)CN)[C@@H](C)O)C(=O)NCC(=O)N1CCC[C@H]1C(=O)N1CCC[C@H]1C(=O)N1CCC[C@H]1C(=O)N[C@@H](C)C(=O)N[C@@H](CC(C)C)C(=O)N[C@@H](C)C(=O)N[C@@H](CC(C)C)C(=O)N[C@@H](C)C(N)=O
: