Target
Galanin receptor type 2
Ligand
BDBM85069
Substrate
Ki
2.9±n/a nM
Comments
PDSP_861
Citation
 Howard, ADTan, CShiao, LLPalyha, OCMcKee, KKWeinberg, DHFeighner, SDCascieri, MASmith, RGVan Der Ploeg, LHSullivan, KA Molecular cloning and characterization of a new receptor for galanin. FEBS Lett 405:285-90 (1997)  
Target
Name:
Galanin receptor type 2
Synonyms:
GALR2_RAT Galanin receptor 2 Galnr2 | Galr2
Type:
Enzyme Catalytic Domain
Mol. Mass.:
40697.04
Organism:
RAT
Description:
Galanin R2 GALR2 RAT::O08726
Residue:
372
  
Inhibitor
Name:
BDBM85069
Synonyms:
Galanin (2-29), rat | Galanin Porcine 2-29
Type:
Small organic molecule
Emp. Form.:
C135H201N41O38
Mol. Mass.:
3006.2923
SMILES:
CCC(C)C(NC(=O)C(C)NC(=O)C(Cc1cnc[nH]1)NC(=O)C1CCCN1C(=O)CNC(=O)C(CC(C)C)NC(=O)C(CC(C)C)NC(=O)C(Cc1ccc(O)cc1)NC(=O)CNC(=O)C(C)NC(=O)C(CO)NC(=O)C(CC(N)=O)NC(=O)C(CC(C)C)NC(=O)C(NC(=O)C(N)Cc1c[nH]c2ccccc12)C(C)O)C(=O)NC(CC(O)=O)C(=O)NC(CC(N)=O)C(=O)NC(Cc1cnc[nH]1)C(=O)NC(CCCN=C(N)N)C(=O)NC(CO)C(=O)NC(Cc1ccccc1)C(=O)NC(CO)C(=O)NC(CC(O)=O)C(=O)NC(CCCCN)C(=O)NC(Cc1cnc[nH]1)C(=O)NCC(=O)NC(CC(C)C)C(N)=O
: