Target
Alpha-1A adrenergic receptor
Ligand
BDBM50019443
Substrate
Ki
7585±n/a nM
Comments
PDSP_1495
Citation
 Mos, JVan Hest, AVan Drimmelen, MHerremans, AHOlivier, B The putative 5-HT1A receptor antagonist DU125530 blocks the discriminative stimulus of the 5-HT1A receptor agonist flesinoxan in pigeons. Eur J Pharmacol 325:145-53 (1997)  
Target
Name:
Alpha-1A adrenergic receptor
Synonyms:
adrenergic Alpha1
Type:
Enzyme Catalytic Domain
Mol. Mass.:
50699.64
Organism:
pigeon
Description:
adrenergic Alpha1 0 pigeon::A0A1V4KJJ8
Residue:
464
  
Inhibitor
Name:
BDBM50019443
Synonyms:
1-(1H-Indol-4-yloxy)-3-isopropylamino-propan-2-ol 1-(1H-Indol-4-yloxy)-3-isopropylamino-propan-2-ol(pindolol) LB-46 PINDOLOL,(-) VISKAZIDE | VISKEN
Type:
Small organic molecule
Emp. Form.:
C14H20N2O2
Mol. Mass.:
248.3208
SMILES:
CC(C)NCC(O)COc1cccc2[nH]ccc12
: