Target
Leukotriene B4 receptor 2
Ligand
BDBM79408
Substrate
Ki
120±n/a nM
Comments
PDSP_1937
Citation
 Yokomizo, TIzumi, TChang, KTakuwa, YShimizu, T A G-protein-coupled receptor for leukotriene B4 that mediates chemotaxis. Nature 387:620-4 (1997)  
Target
Name:
Leukotriene B4 receptor 2
Synonyms:
BLT2R LT4R2_HUMAN LTB4-R 2 LTB4R2 Leukotriene B4 Leukotriene B4 receptor Leukotriene B4 receptor BLT2 Seven transmembrane receptor BLTR2
Type:
Enzyme Catalytic Domain
Mol. Mass.:
37964.86
Organism:
Homo sapiens (Human)
Description:
Leukotriene 2 0 HUMAN::Q9NPC1
Residue:
358
  
Inhibitor
Name:
BDBM79408
Synonyms:
(5R)-6-[6-[(1E,3S,5Z)-3-hydroxyundeca-1,5-dienyl]-2-pyridinyl]hexane-1,5-diol (5R)-6-[6-[(1E,3S,5Z)-3-hydroxyundeca-1,5-dienyl]pyridin-2-yl]hexane-1,5-diol MLS000028864 U-75302 | cid_6852392
Type:
Small organic molecule
Emp. Form.:
C22H35NO3
Mol. Mass.:
361.5182
SMILES:
CCCCC\C=C/C[C@H](O)\C=C\c1cccc(C[C@H](O)CCCCO)n1
: