Target
Oxytocin receptor
Ligand
BDBM50029644
Substrate
Ki
333±n/a nM
Comments
PDSP_1415
Citation
 Tahara, ATomura, YWada, KIKusayama, TTsukada, JTakanashi, MYatsu, TUchida, WTanaka, A Pharmacological profile of YM087, a novel potent nonpeptide vasopressin V1A and V2 receptor antagonist, in vitro and in vivo. J Pharmacol Exp Ther 282:301-8 (1997) Target
Name:
Oxytocin receptor
Synonyms:
OT-R Otr Oxytocin
Type:
Enzyme Catalytic Domain
Mol. Mass.:
42889.28
Organism:
RAT
Description:
Oxytocin OXTR RAT::P70536
Residue:
388
  
Inhibitor
Name:
BDBM50029644
Synonyms:
CHEMBL296908 N-(3-{4-[4-(2-Oxo-3,4-dihydro-2H-quinolin-1-yl)-piperidine-1-carbonyl]-phenoxy}-propyl)-acetamide OPC-21268
Type:
Small organic molecule
Emp. Form.:
C26H31N3O4
Mol. Mass.:
449.542
SMILES:
CC(=O)NCCCOc1ccc(cc1)C(=O)N1CCC(CC1)N1C(=O)CCc2ccccc12
: