Target
Vasopressin V2 receptor
Ligand
BDBM50013775
Substrate
Ki
1010±n/a nM
Comments
PDSP_1429
Citation
 Tahara, ATomura, YWada, KIKusayama, TTsukada, JTakanashi, MYatsu, TUchida, WTanaka, A Pharmacological profile of YM087, a novel potent nonpeptide vasopressin V1A and V2 receptor antagonist, in vitro and in vivo. J Pharmacol Exp Ther 282:301-8 (1997) Target
Name:
Vasopressin V2 receptor
Synonyms:
AVPR V2 Avpr2 V2R_RAT Vasopressin receptor
Type:
G-protein coupled receptor
Mol. Mass.:
40761.85
Organism:
Rattus norvegicus (Rat)
Description:
Residue:
371
  
Inhibitor
Name:
BDBM50013775
Synonyms:
(oxytocin-OT) cyclo[Cys-Tyr-Ile-Gln-Asn-Cys]-Pro-Leu-Gly-NH2 1-[19-Amino-13-sec-butyl-10-(2-carbamoyl-ethyl)-7-carbamoylmethyl-16-(4-hydroxy-benzyl)-6,9,12,15,18-pentaoxo-1,2-dithia-5,8,11,14,17-pentaaza-cycloicosane-4-carbonyl]-pyrrolidine-2-carboxylic acid [1-(carbamoylmethyl-carbamoyl)-3-methyl-butyl]-amide(Oxytocin) CHEMBL265640 OXYTOCIN
Type:
Small organic molecule
Emp. Form.:
C43H66N12O12S2
Mol. Mass.:
1007.187
SMILES:
CCC(C)[C@@H]1NC(=O)[C@H](Cc2ccc(O)cc2)NC(=O)[C@H](N)CSSCC(NC(=O)[C@H](CC(N)=O)NC(=O)[C@H](CCC(N)=O)NC1=O)C(=O)N1CCCC1C(=O)N[C@@H](CC(C)C)C(=O)NCC(N)=O
: