Target
5-hydroxytryptamine receptor 2A
Ligand
BDBM50001915
Substrate
Ki
371.53±n/a nM
Comments
PDSP_1168
Citation
 Bonhaus, DWWeinhardt, KKTaylor, MDeSouza, AMcNeeley, PMSzczepanski, KFontana, DJTrinh, JRocha, CLDawson, MWFlippin, LAEglen, RM RS-102221: a novel high affinity and selective, 5-HT2C receptor antagonist. Neuropharmacology 36:621-9 (1997)  
Target
Name:
5-hydroxytryptamine receptor 2A
Synonyms:
5-HT-2A 5-HT2A 5-hydroxytryptamine receptor 2A (5HT2A) Htr2 Serotonin Receptor 2A
Type:
G Protein-Coupled Receptor (GPCR)
Mol. Mass.:
52852.05
Organism:
Rattus norvegicus (rat)
Description:
Rat cortex membranes 5-HT2A receptors.
Residue:
471
  
Inhibitor
Name:
BDBM50001915
Synonyms:
1-(3-chlorophenyl)piperazine m-Chlorophenylpiperazine | mCPP
Type:
Small organic molecule
Emp. Form.:
C10H13ClN2
Mol. Mass.:
196.677
SMILES:
Clc1cccc(c1)N1CCNCC1
: