Target
5-hydroxytryptamine receptor 2C
Ligand
BDBM84991
Substrate
Ki
1995.26±n/a nM
Comments
PDSP_1673
Citation
 Bonhaus, DWWeinhardt, KKTaylor, MDeSouza, AMcNeeley, PMSzczepanski, KFontana, DJTrinh, JRocha, CLDawson, MWFlippin, LAEglen, RM RS-102221: a novel high affinity and selective, 5-HT2C receptor antagonist. Neuropharmacology 36:621-9 (1997)  
Target
Name:
5-hydroxytryptamine receptor 2C
Synonyms:
5-HT-2C 5-HT2C-INI 5-HTR2C 5-hydroxytryptamine receptor 2C (5-HT-2C) 5HT-1C HTR1C Serotonin (5-HT3) receptor Serotonin Receptor 2C
Type:
G Protein-Coupled Receptor (GPCR)
Mol. Mass.:
51836.79
Organism:
Homo sapiens (Human)
Description:
P28335
Residue:
458
  
Inhibitor
Name:
BDBM84991
Synonyms:
CAS_3277600 SB204741
Type:
Small organic molecule
Emp. Form.:
C14H14N4OS
Mol. Mass.:
286.352
SMILES:
Cc1cc(NC(=O)Nc2ccc3n(C)ccc3c2)sn1
: