Target
Serotonin N-acetyltransferase
Ligand
BDBM85110
Substrate
Meas. Tech.
Spectrophotometric Assay
pH
6.8±0
Temperature
303.15±0 K
Ki
67±n/a nM
Citation
 Zheng, WCole, PA Novel bisubstrate analog inhibitors of serotonin N-acetyltransferase: the importance of being neutral. Bioorg Chem 31:398-411 (2003)  
Target
Name:
Serotonin N-acetyltransferase
Synonyms:
AANAT SNAT Serotonin N-acetyltransferase (AANAT)
Type:
Protein
Mol. Mass.:
23350.36
Organism:
Homo sapiens (Human)
Description:
Q16613
Residue:
207
  
Inhibitor
Name:
BDBM85110
Synonyms:
AANAT bisubstrate analog, 2
Type:
Small organic molecule
Emp. Form.:
C34H52N9O17P3S
Mol. Mass.:
983.813
SMILES:
CC(C)(COP(O)(=O)OP(O)(=O)OC[C@H]1OC([C@@H](O)[C@@H]1OP(O)(O)=O)n1cnc2c(N)ncnc12)[C@@H](O)C(=O)NCCC(=O)NCCSCCC(=O)NCCc1c[nH]c2CC=CCc12
: