Target
Gamma-aminobutyric acid receptor subunit alpha-3
Ligand
BDBM24185
Substrate
Ki
750±n/a nM
Comments
PDSP_3488
Citation
 Chebib, MVandenberg, RJFroestl, WJohnston, GA Unsaturated phosphinic analogues of gamma-aminobutyric acid as GABA(C) receptor antagonists. Eur J Pharmacol 329:223-9 (1997) Target
Name:
Gamma-aminobutyric acid receptor subunit alpha-3
Synonyms:
GABA A Alpha3Beta3Gamma2 GABA C GABA-A receptor GBRA3_HUMAN agonist GABA site
Type:
Enzyme Catalytic Domain
Mol. Mass.:
55175.47
Organism:
Homo sapiens (Human)
Description:
GABA A Alpha3Beta1Gamma2 0 HUMAN::P34903
Residue:
492
  
Inhibitor
Name:
BDBM24185
Synonyms:
(3-aminopropyl)(methyl)phosphinic acid 3-aminopropylphosphinic derivative, 2 CHEMBL112710 | SKF-97541
Type:
Small organic molecule
Emp. Form.:
C4H12NO2P
Mol. Mass.:
137.1173
SMILES:
CP(O)(=O)CCCN
: