Target
Alkaline phosphatase, tissue-nonspecific isozyme
Ligand
BDBM275090
Substrate
Meas. Tech.
TNAP Inhibition Activity
Temperature
298.15±n/a K
IC50
4.10±n/a nM
Comments
extracted
Citation
 Miyazaki, SYamamoto, YSuzuki, KInui, MIzumi, MSoma, KPinkerton, AShinozaki, T Pyridine compounds US Patent  US9879032 Publication Date 1/30/2018 
Target
Name:
Alkaline phosphatase, tissue-nonspecific isozyme
Synonyms:
ALPL tissue-nonspecific alkaline phosphatase precursor
Type:
PROTEIN
Mol. Mass.:
57306.17
Organism:
Homo sapiens (Human)
Description:
ChEMBL_1448917
Residue:
524
  
Inhibitor
Name:
BDBM275090
Synonyms:
US10221195, Example 32 | US9879032, Example 32
Type:
Small organic molecule
Emp. Form.:
C16H13F4N3O6S
Mol. Mass.:
451.35
SMILES:
OC[C@H]1COc2ncc(NS(=O)(=O)c3cc(F)ccc3OC(F)(F)F)cc2C(=O)N1
: