Target
Galanin receptor type 1
Ligand
BDBM85170
Substrate
Ki
1000±n/a nM
Comments
PDSP_862
Citation
 Smith, KEForray, CWalker, MWJones, KATamm, JABard, JBranchek, TALinemeyer, DLGerald, C Expression cloning of a rat hypothalamic galanin receptor coupled to phosphoinositide turnover. J Biol Chem 272:24612-6 (1997)  
Target
Name:
Galanin receptor type 1
Synonyms:
GALR1_RAT Galanin receptor type 1 Galnr1 | Galr1
Type:
Enzyme Catalytic Domain
Mol. Mass.:
38883.91
Organism:
RAT
Description:
Galanin R1 GALR1 RAT::Q62805
Residue:
346
  
Inhibitor
Name:
BDBM85170
Synonyms:
Galanin (3-29), porcine
Type:
Small organic molecule
Emp. Form.:
C133H199N39O39
Mol. Mass.:
2968.2411
SMILES:
CCC(C)[C@H](NC(=O)[C@H](C)NC(=O)[C@H](Cc1cnc[nH]1)NC(=O)[C@@H]1CCCN1C(=O)CNC(=O)[C@H](CC(C)C)NC(=O)[C@H](CC(C)C)NC(=O)[C@H](Cc1ccc(O)cc1)NC(=O)CNC(=O)[C@H](C)NC(=O)[C@H](CO)NC(=O)[C@H](CC(N)=O)NC(=O)[C@H](CC(C)C)NC(=O)[C@@H](N)[C@@H](C)O)C(=O)NC(CC(O)=O)C(=O)N[C@@H](CC(N)=O)C(=O)N[C@@H](Cc1cnc[nH]1)C(=O)N[C@@H](CCCN=C(N)N)C(=O)N[C@@H](CO)C(=O)N[C@@H](Cc1ccccc1)C(=O)N[C@@H](Cc1cnc[nH]1)C(=O)N[C@@H](CC(O)=O)C(=O)N[C@@H](CCCCN)C(=O)N[C@@H](Cc1ccc(O)cc1)C(=O)NCC(=O)N[C@@H](CC(C)C)C(=O)N[C@@H](C)C(O)=O
: