Target
Prostaglandin E2 receptor EP1 subtype
Ligand
BDBM82094
Substrate
Ki
14±n/a nM
Comments
PDSP_1464
Citation
 Kiriyama, MUshikubi, FKobayashi, THirata, MSugimoto, YNarumiya, S Ligand binding specificities of the eight types and subtypes of the mouse prostanoid receptors expressed in Chinese hamster ovary cells. Br J Pharmacol 122:217-24 (1997)  
Target
Name:
Prostaglandin E2 receptor EP1 subtype
Synonyms:
PE2R1_MOUSE Prostaglandin E1 Prostanoid EP1 receptor Ptgerep1
Type:
G-protein coupled receptor
Mol. Mass.:
43000.62
Organism:
Mus musculus (Mouse)
Description:
Residue:
405
  
Inhibitor
Name:
BDBM82094
Synonyms:
17-PHENYL TRINOR PROSTAGLANDIN E2 PGE2,17-Phenyl
Type:
Small organic molecule
Emp. Form.:
C23H30O5
Mol. Mass.:
386.4813
SMILES:
O[C@@H](CCc1ccccc1)\C=C\[C@H]1[C@H](O)CC(=O)[C@@H]1C\C=C/CCCC(O)=O
: